BDBM50004671 CHEMBL106418::N-[2-(5-Dimethylaminomethyl-furan-2-ylmethylsulfanyl)-ethyl]-4,6-dinitro-N'-pentyl-benzene-1,3-diamine
SMILES CCCCCNc1cc(NCCSCc2ccc(CN(C)C)o2)c(cc1[N+]([O-])=O)[N+]([O-])=O
InChI Key InChIKey=HBZHFOIRLAOODA-UHFFFAOYSA-N
Data  1 IC50
  Tab Delimited (TSV)   2D SDfile   Computed 3D by Vconf -m prep SDfile
Find this compound or compounds like it in BindingDB:
Activity Spreadsheet -- Enzyme Inhibition Constant Data from BindingDB
Found 1 hit for monomerid = 50004671
TargetAcetylcholinesterase(Homo sapiens (Human))
University Of South Carolina
Curated by ChEMBL
LigandPNGBDBM50004671(CHEMBL106418 | N-[2-(5-Dimethylaminomethyl-furan-2...)
Affinity DataIC50:  1.20E+3nM. Assay description: In vitro inhibition of human acetylcholinesterase.
In DepthDetails ArticlePubMed