BDBM50004697 DEAMINOFORMYCIN
SMILES OC[C@H]1O[C@H]([C@H](O)[C@@H]1O)c1n[nH]c2cncnc12
InChI Key InChIKey=OGBPXKPYHVPAOL-KBHCAIDQSA-N
Data  1 IC50
  Tab Delimited (TSV)   2D SDfile   Computed 3D by Vconf -m prep SDfile
Find this compound or compounds like it in BindingDB:
Activity Spreadsheet -- Enzyme Inhibition Constant Data from BindingDB
Found 1 hit for monomerid = 50004697
TargetAdenosine deaminase(Bos taurus (bovine))
Agrevo
Curated by ChEMBL
LigandPNGBDBM50004697(DEAMINOFORMYCIN)
Affinity DataIC50:  5.00E+3nM. Assay description: Inhibition of Bos taurus (calf) intestinal mucosa adenylate deaminase
In DepthDetails ArticlePubMed