BDBM50004835 CHEMBL2324100
SMILES Oc1ccc(cc1)C1=NO[C@@H](Cc2ccccc2)C1
InChI Key InChIKey=VWGGYOJVUGYREV-HNNXBMFYSA-N
Data  1 IC50
  Tab Delimited (TSV)   2D SDfile   Computed 3D by Vconf -m prep SDfile
Find this compound or compounds like it in BindingDB:
Activity Spreadsheet -- Enzyme Inhibition Constant Data from BindingDB
Found 1 hit for monomerid = 50004835
TargetLuciferin 4-monooxygenase(Photinus pyralis)
University Of Eastern Finland
Curated by ChEMBL
LigandPNGBDBM50004835(CHEMBL2324100)
Affinity DataIC50: >1.00E+4nM. Assay description: Inhibition of recombinant firefly luciferase after 20 mins by luminescence assay
In DepthDetails ArticlePubMed