BDBM50004866 CHEMBL2324101
SMILES Fc1ccccc1C1=NO[C@H](Cc2ccccc2)C1
InChI Key InChIKey=SINKLGMBHNVUNA-CYBMUJFWSA-N
Data  1 IC50
  Tab Delimited (TSV)   2D SDfile   Computed 3D by Vconf -m prep SDfile
Find this compound or compounds like it in BindingDB:
Activity Spreadsheet -- Enzyme Inhibition Constant Data from BindingDB
Found 1 hit for monomerid = 50004866
TargetLuciferin 4-monooxygenase(Photinus pyralis)
University Of Eastern Finland
Curated by ChEMBL
LigandPNGBDBM50004866(CHEMBL2324101)
Affinity DataIC50:  0.950nM. Assay description: Inhibition of recombinant firefly luciferase after 20 mins by luminescence assay
In DepthDetails ArticlePubMed