BDBM50004989 CHEMBL265167::His-Ala-Asp-Ala-Ile-Phe-Thr-Ser-Ser-Tyr-Arg-Arg-Ile-Leu-Gly-Gln-Leu-Tyr-Ala-Arg-Lys-Leu-Leu-His-Glu-Ile-Met-Asn-Arg-NH2
SMILES CC[C@H](C)[C@H](NC(=O)[C@H](C)NC(=O)[C@H](CC(O)=O)NC(=O)[C@H](C)NC(=O)[C@@H](N)Cc1c[nH]cn1)C(=O)N[C@@H](Cc1ccccc1)C(=O)N[C@@H]([C@@H](C)O)C(=O)N[C@@H](CO)C(=O)N[C@@H](CO)C(=O)N[C@@H](Cc1ccc(O)cc1)C(=O)N[C@@H](CCCN=C(N)N)C(=O)N[C@@H](CCCN=C(N)N)C(=O)N[C@@H]([C@@H](C)CC)C(=O)N[C@@H](CC(C)C)C(=O)NCC(=O)N[C@@H](CCC(N)=O)C(=O)N[C@@H](CC(C)C)C(=O)N[C@@H](Cc1ccc(O)cc1)C(=O)N[C@@H](C)C(=O)N[C@@H](CCCN=C(N)N)C(=O)N[C@@H](CCCCN)C(=O)N[C@@H](CC(C)C)C(=O)N[C@@H](CC(C)C)C(=O)N[C@@H](Cc1c[nH]cn1)C(=O)N[C@@H](CCC(O)=O)C(=O)N[C@@H]([C@@H](C)CC)C(=O)N[C@@H](CCSC)C(=O)N[C@@H](CC(N)=O)C(=O)N[C@@H](CCCN=C(N)N)C(N)=O
InChI Key InChIKey=MEFNIEDWNSBZSR-UCRGYRMUSA-N
Data  1 IC50
  Tab Delimited (TSV)   2D SDfile   Computed 3D by Vconf -m prep SDfile
Find this compound or compounds like it in BindingDB:
Activity Spreadsheet -- Enzyme Inhibition Constant Data from BindingDB
Found 1 hit for monomerid = 50004989
TargetGrowth hormone-releasing hormone receptor(Rattus norvegicus)
Notre-Dame Hospital Research
Curated by ChEMBL
LigandPNGBDBM50004989(CHEMBL265167 | His-Ala-Asp-Ala-Ile-Phe-Thr-Ser-Ser...)
Affinity DataIC50:  9.80nM. Assay description: Compound was tested to Inhibit [125I]-Growth hormone-releasing factor in rat adenopituitary homogenates
In DepthDetails ArticlePubMed