BDBM50005074 5,7-Dichloro-4-(3-cyclohexyl-ureido)-1,2,3,4-tetrahydro-quinoline-2-carboxylic acid::CHEMBL61582
SMILES OC(=O)[C@H]1C[C@H](NC(=O)NC2CCCCC2)c2c(Cl)cc(Cl)cc2N1
InChI Key InChIKey=NSEIGQYUSFJQQX-UONOGXRCSA-N
Data  1 IC50
  Tab Delimited (TSV)   2D SDfile   Computed 3D by Vconf -m prep SDfile
Find this compound or compounds like it in BindingDB:
Activity Spreadsheet -- Enzyme Inhibition Constant Data from BindingDB
Found 1 hit for monomerid = 50005074
TargetGlutamate receptor ionotropic, NMDA 1(RAT)
Merck Sharp And Dohme Research Laboratories
Curated by ChEMBL
LigandPNGBDBM50005074(5,7-Dichloro-4-(3-cyclohexyl-ureido)-1,2,3,4-tetra...)
Affinity DataIC50:  28nM. Assay description: Inhibition of [3H]- glycine binding to NMDA receptor from rat cortical membranes.
In DepthDetails ArticlePubMed