BDBM50005078 4-Benzyloxycarbonylamino-5,7-dichloro-1,2,3,4-tetrahydro-quinoline-2-carboxylic acid::CHEMBL61447
SMILES OC(=O)[C@H]1C[C@H](NC(=O)OCc2ccccc2)c2c(Cl)cc(Cl)cc2N1
InChI Key InChIKey=FVDAKKSMPCAEBA-LSDHHAIUSA-N
Data  1 IC50
  Tab Delimited (TSV)   2D SDfile   Computed 3D by Vconf -m prep SDfile
Find this compound or compounds like it in BindingDB:
Activity Spreadsheet -- Enzyme Inhibition Constant Data from BindingDB
Found 1 hit for monomerid = 50005078
TargetGlutamate receptor ionotropic, NMDA 1(RAT)
Merck Sharp And Dohme Research Laboratories
Curated by ChEMBL
LigandPNGBDBM50005078(4-Benzyloxycarbonylamino-5,7-dichloro-1,2,3,4-tetr...)
Affinity DataIC50:  79nM. Assay description: Inhibition of [3H]- glycine binding to NMDA receptor from rat cortical membranes.
In DepthDetails ArticlePubMed