BDBM50005137 CHEMBL418386::[4-(3-Chloro-phenyl)-piperazin-1-yl]-phenyl-methanone
SMILES Clc1cccc(c1)N1CCN(CC1)C(=O)c1ccccc1
InChI Key InChIKey=YBPFUQMJALVNAF-UHFFFAOYSA-N
Data  2 KI
  Tab Delimited (TSV)   2D SDfile   Computed 3D by Vconf -m prep SDfile
Find this compound or compounds like it in BindingDB:
Activity Spreadsheet -- Enzyme Inhibition Constant Data from BindingDB
Found 2 hits for monomerid = 50005137
Target5-hydroxytryptamine receptor 1A(Rattus norvegicus (rat))
Universit£
Curated by ChEMBL
LigandPNGBDBM50005137(CHEMBL418386 | [4-(3-Chloro-phenyl)-piperazin-1-yl...)
Affinity DataKi:  1.00E+5nM. Assay description: Binding affinity of a compound to rat brain 5-hydroxytryptamine 1A (serotonin) receptor assayed by radiolabeled [3H]-8-OH-DPAT ligand displacement
In DepthDetails ArticlePubMed
Target5-hydroxytryptamine receptor 1A(Rattus norvegicus (rat))
Universit£
Curated by ChEMBL
LigandPNGBDBM50005137(CHEMBL418386 | [4-(3-Chloro-phenyl)-piperazin-1-yl...)
Affinity DataKi: >1.00E+5nM. Assay description: In vitro ability to displace [3H]-8-hydroxy-2-(di-n-propylamino) tetralin binding from 5-hydroxytryptamine 1A receptor site in rat brain hippocampus
In DepthDetails ArticlePubMed