BDBM50005175 CHEMBL159116::N-(1-{Benzyl-[(3,3,3-trifluoro-1-isopropyl-2-oxo-propylcarbamoyl)-methyl]-carbamoyl}-2-methyl-propyl)-4-(4-chloro-benzenesulfonylaminocarbonyl)-benzamide
SMILES CC(C)C(NC(=O)c1ccc(cc1)C(=O)NS(=O)(=O)c1ccc(Cl)cc1)C(=O)N(CC(=O)NC(C(C)C)C(=O)C(F)(F)F)Cc1ccccc1
InChI Key InChIKey=FVTMMXGQLWOOKX-UHFFFAOYSA-N
Data  1 IC50
  Tab Delimited (TSV)   2D SDfile   Computed 3D by Vconf -m prep SDfile
Find this compound or compounds like it in BindingDB:
Activity Spreadsheet -- Enzyme Inhibition Constant Data from BindingDB
Found 1 hit for monomerid = 50005175
TargetNeutrophil elastase(Homo sapiens (Human))
Boehringer Ingelheim Pharmaceuticals
Curated by ChEMBL
LigandPNGBDBM50005175(CHEMBL159116 | N-(1-{Benzyl-[(3,3,3-trifluoro-1-is...)
Affinity DataIC50:  217nM. Assay description: In vitro inhibitory activity against human leukocyte elastase
In DepthDetails ArticlePubMed