BDBM50005239 2-{[Acetyl-(5-ethoxy-tetrahydro-furan-3-ylmethoxycarbonyl)-amino]-methyl}-1-ethyl-pyridinium; iodide::CHEMBL159055
SMILES CCOC1CC(COC(=O)N(Cc2cccc[n+]2CC)C(C)=O)CO1
InChI Key InChIKey=OKHTYLGVQYVAKN-UHFFFAOYSA-N
Data  1 IC50
  Tab Delimited (TSV)   2D SDfile   Computed 3D by Vconf -m prep SDfile
Find this compound or compounds like it in BindingDB:
Activity Spreadsheet -- Enzyme Inhibition Constant Data from BindingDB
Found 1 hit for monomerid = 50005239
TargetPlatelet-activating factor receptor(Cavia porcellus)
J. Uriach & CíA.
Curated by ChEMBL
LigandPNGBDBM50005239(2-{[Acetyl-(5-ethoxy-tetrahydro-furan-3-ylmethoxyc...)
Affinity DataIC50:  2.80E+3nM. Assay description: In vitro inhibition of PAF induced aggregation of rabbit platelets.
In DepthDetails ArticlePubMed