BDBM50005398 CHEMBL2206694
SMILES Nc1c(cc(-c2ccccc2)n1Cc1nc2ccccc2[nH]1)C#N
InChI Key InChIKey=QLQQXNCULFMERS-UHFFFAOYSA-N
Data  1 KI
  Tab Delimited (TSV)   2D SDfile   Computed 3D by Vconf -m prep SDfile
Find this compound or compounds like it in BindingDB:
Activity Spreadsheet -- Enzyme Inhibition Constant Data from BindingDB
Found 1 hit for monomerid = 50005398
TargetUrokinase plasminogen activator surface receptor(Homo sapiens (Human))
National Research Center
Curated by ChEMBL
LigandPNGBDBM50005398(CHEMBL2206694)
Affinity DataKi:  0.00100nM. Assay description: Binding affinity to uPAR
In DepthDetails ArticlePubMed