BDBM50005416 3-Hydroxy-4-[3-(1H-imidazol-4-yl)-2-(3-naphthalen-1-yl-2-naphthalen-1-ylmethyl-propionylamino)-propionylamino]-6-methyl-heptanoic acid (2-methyl-butyl)-amide::CHEMBL3350030
SMILES CC[C@H](C)CNC(=O)C[C@H](O)[C@H](CC(C)C)NC(=O)C(Cc1c[nH]cn1)NC(=O)C(Cc1cccc2ccccc12)Cc1cccc2ccccc12
InChI Key InChIKey=SHGYNXXABXGXNI-IBFRYQSXSA-N
Data  1 IC50
  Tab Delimited (TSV)   2D SDfile   Computed 3D by Vconf -m prep SDfile
Find this compound or compounds like it in BindingDB:
Activity Spreadsheet -- Enzyme Inhibition Constant Data from BindingDB
Found 1 hit for monomerid = 50005416
TargetRenin(Homo sapiens (Human))
Warner-Lambert
Curated by ChEMBL
LigandPNGBDBM50005416(3-Hydroxy-4-[3-(1H-imidazol-4-yl)-2-(3-naphthalen-...)
Affinity DataIC50:  85nM. Assay description: Inhibitory activity against monkey renin in vitro.
In DepthDetails ArticlePubMed