BDBM50005441 3-Hydroxy-6-methyl-4-[2-(3-naphthalen-1-yl-2-naphthalen-1-ylmethyl-propionylamino)-2-phenylamino-acetylamino]-heptanoic acid (2-methyl-butyl)-amide::CHEMBL3350023
SMILES CC[C@H](C)CNC(=O)C[C@H](O)[C@H](CC(C)C)NC(=O)C(NC(=O)C(Cc1cccc2ccccc12)Cc1cccc2ccccc12)Nc1ccccc1
InChI Key InChIKey=ODZLAERBESNOMU-FODWBZTASA-N
Data  1 IC50
  Tab Delimited (TSV)   2D SDfile   Computed 3D by Vconf -m prep SDfile
Find this compound or compounds like it in BindingDB:
Activity Spreadsheet -- Enzyme Inhibition Constant Data from BindingDB
Found 1 hit for monomerid = 50005441
TargetRenin(Homo sapiens (Human))
Warner-Lambert
Curated by ChEMBL
LigandPNGBDBM50005441(3-Hydroxy-6-methyl-4-[2-(3-naphthalen-1-yl-2-napht...)
Affinity DataIC50:  310nM. Assay description: Inhibitory activity against monkey renin in vitro.
In DepthDetails ArticlePubMed