BDBM50005550 8-Allyl-3-(4-fluoro-phenyl)-8-aza-bicyclo[3.2.1]octane-2-carboxylic acid methyl ester::CHEMBL48225
SMILES COC(=O)C1C2CCC(C[C@@H]1c1ccc(F)cc1)N2CC=C
InChI Key InChIKey=BNBZBLRBYOEGLO-ZKDDFBJFSA-N
Data  2 IC50
  Tab Delimited (TSV)   2D SDfile   Computed 3D by Vconf -m prep SDfile
Find this compound or compounds like it in BindingDB:
Activity Spreadsheet -- Enzyme Inhibition Constant Data from BindingDB
Found 2 hits for monomerid = 50005550
TargetSodium-dependent dopamine transporter(Rattus norvegicus (rat))
Research Triangle Institute
Curated by ChEMBL
LigandPNGBDBM50005550(8-Allyl-3-(4-fluoro-phenyl)-8-aza-bicyclo[3.2.1]oc...)
Affinity DataIC50:  23nM. Assay description: Inhibition of [3H]cocaine binding to the dopamine transporter.
In DepthDetails ArticlePubMed
TargetSodium-dependent dopamine transporter(Rattus norvegicus (rat))
Research Triangle Institute
Curated by ChEMBL
LigandPNGBDBM50005550(8-Allyl-3-(4-fluoro-phenyl)-8-aza-bicyclo[3.2.1]oc...)
Affinity DataIC50:  23nM. Assay description: Compound was evaluated for inhibition of specifically bound [3H]- cocaine (2.7 nM) against Dopamine transporter in cynomolgus monkeys
In DepthDetails ArticlePubMed