BDBM50005722 1-Allylamino-3-aminooxy-propan-2-ol::CHEMBL26418
SMILES NOCC(O)CNCC=C
InChI Key InChIKey=ARUQPLWGHMJTRI-UHFFFAOYSA-N
Data  1 IC50
  Tab Delimited (TSV)   2D SDfile   Computed 3D by Vconf -m prep SDfile
Find this compound or compounds like it in BindingDB:
Activity Spreadsheet -- Enzyme Inhibition Constant Data from BindingDB
Found 1 hit for monomerid = 50005722
TargetOrnithine decarboxylase(Rattus norvegicus)
Ciba-Geigy
Curated by ChEMBL
LigandPNGBDBM50005722(1-Allylamino-3-aminooxy-propan-2-ol | CHEMBL26418)
Affinity DataIC50:  2.10E+4nM. Assay description: Inhibitory activity against Rat liver ornithine decarboxylase(ODC)
In DepthDetails ArticlePubMed