BDBM50005781 ALVESPIMYCIN::CHEBI:65324
SMILES CO[C@H]1C[C@H](C)CC2=C(NCCN(C)C)C(=O)C=C(NC(=O)\C(C)=C\C=C/[C@H](OC)[C@@H](OC(N)=O)\C(C)=C\[C@H](C)[C@H]1O)C2=O
InChI Key InChIKey=KUFRQPKVAWMTJO-LMZWQJSESA-N
Data  20 IC50  1 EC50
PDB links: 1 PDB ID matches this monomer.
  Tab Delimited (TSV)   2D SDfile   Computed 3D by Vconf -m prep SDfile
Find this compound or compounds like it in BindingDB:
Activity Spreadsheet -- Enzyme Inhibition Constant Data from BindingDB
Found 21 hits for monomerid = 50005781
TargetHeat shock protein HSP 90-beta(Homo sapiens (Human))
China Pharmaceutical University
Curated by ChEMBL
LigandPNGBDBM50005781(ALVESPIMYCIN | CHEBI:65324)
Affinity DataIC50:  1.41E+3nM. Assay description: Inhibition of full-length HSP90 (unknown origin) expressed in Escherichia coli assessed as inhibition of ATPase activity after 3 hrs by spectrophotom...
TargetLysine-specific demethylase 6B(Homo sapiens (Human))
St. Jude Children'S Research Hospital
Curated by ChEMBL
LigandPNGBDBM50005781(ALVESPIMYCIN | CHEBI:65324)
Affinity DataIC50:  400nM. Assay description: Inhibition of KDM6B (unknown origin) measured by AlphaScreen assay
In DepthDetails PubMed
TargetHeat shock protein HSP 90-beta(Homo sapiens (Human))
China Pharmaceutical University
Curated by ChEMBL
LigandPNGBDBM50005781(ALVESPIMYCIN | CHEBI:65324)
Affinity DataIC50:  930nM. Assay description: Inhibition of full-length Hsp90-ATPase activity (unknown origin) assessed as inhibition of ATP hydrolysis by spectrophotometry
TargetEndothelial PAS domain-containing protein 1/Hypoxia-inducible factor 1-alpha(Homo sapiens (Human))
Korean Research Institute Of Biosciences And Biotechnology
Curated by ChEMBL
LigandPNGBDBM50005781(ALVESPIMYCIN | CHEBI:65324)
Affinity DataIC50:  36nM. Assay description: Inhibition of HIF1 activation in human AGS cells assessed as inhibition of hypoxia-induced luciferase expression after 16 hrs by reporter assay
In DepthDetails ArticlePubMed
TargetEndothelial PAS domain-containing protein 1/Hypoxia-inducible factor 1-alpha(Homo sapiens (Human))
Korean Research Institute Of Biosciences And Biotechnology
Curated by ChEMBL
LigandPNGBDBM50005781(ALVESPIMYCIN | CHEBI:65324)
Affinity DataIC50:  61nM. Assay description: Inhibition of HIF1 activation in human Hep3B cells assessed as inhibition of hypoxia-induced luciferase expression after 16 hrs by reporter assay
In DepthDetails ArticlePubMed
TargetEndothelial PAS domain-containing protein 1/Hypoxia-inducible factor 1-alpha(Homo sapiens (Human))
Korean Research Institute Of Biosciences And Biotechnology
Curated by ChEMBL
LigandPNGBDBM50005781(ALVESPIMYCIN | CHEBI:65324)
Affinity DataIC50: >3.00E+4nM. Assay description: Inhibition of hypoxia-induced HIF1 activation in human Hep3B cells by pGL3-HRE-luciferase reporter gene assay
In DepthDetails ArticlePubMed
TargetHypoxia-inducible factor 1-alpha(Homo sapiens (Human))
Korean Research Institute Of Biosciences And Biotechnology
Curated by ChEMBL
LigandPNGBDBM50005781(ALVESPIMYCIN | CHEBI:65324)
Affinity DataIC50:  57nM. Assay description: Inhibition of hypoxia-induced HIF1alpha protein accumulation in human Hep3B cells treated for 30 mins measured after 12 hrs by Western blot analysis
In DepthDetails ArticlePubMed
TargetHypoxia-inducible factor 1-alpha(Homo sapiens (Human))
Korean Research Institute Of Biosciences And Biotechnology
Curated by ChEMBL
LigandPNGBDBM50005781(ALVESPIMYCIN | CHEBI:65324)
Affinity DataIC50:  57nM. Assay description: Inhibition of hypoxia-induced HIF1alpha protein accumulation in human Hep3B cells treated for 30 mins measured after 12 hrs by Western blot analysis
In DepthDetails ArticlePubMed
TargetHeat shock protein HSP 90-alpha/90-beta(Homo sapiens (Human))
Pfizer
Curated by ChEMBL
LigandPNGBDBM50005781(ALVESPIMYCIN | CHEBI:65324)
Affinity DataIC50:  100nM. Assay description: Inhibition of Hsp90 in human H1299 assessed as degradation of Hsp90 client protein Akt
TargetEndothelial PAS domain-containing protein 1/Hypoxia-inducible factor 1-alpha(Homo sapiens (Human))
Korean Research Institute Of Biosciences And Biotechnology
Curated by ChEMBL
LigandPNGBDBM50005781(ALVESPIMYCIN | CHEBI:65324)
Affinity DataIC50:  3.60nM. Assay description: Inhibition of hypoxia-induced HIF1 activation in human AGS cells by reporter gene assay
In DepthDetails ArticlePubMed
TargetHeat shock protein HSP 90-alpha/90-beta(Homo sapiens (Human))
Pfizer
Curated by ChEMBL
LigandPNGBDBM50005781(ALVESPIMYCIN | CHEBI:65324)
Affinity DataIC50:  18nM. Assay description: Inhibition of Hsp90 in human MDA-MB-231 cells assessed as Akt degradation
TargetHeat shock protein HSP 90-alpha/90-beta(Homo sapiens (Human))
Pfizer
Curated by ChEMBL
LigandPNGBDBM50005781(ALVESPIMYCIN | CHEBI:65324)
Affinity DataIC50:  4.5nM. Assay description: Inhibition of Hsp90 in human MDA-MB-231 cells assessed as her2 degradation
TargetHeat shock protein HSP 90-alpha/90-beta(Homo sapiens (Human))
Pfizer
Curated by ChEMBL
LigandPNGBDBM50005781(ALVESPIMYCIN | CHEBI:65324)
Affinity DataIC50:  24nM. Assay description: Inhibition of Hsp90 in human A2058 cells assessed as Akt degradation
TargetHeat shock protein HSP 90-alpha/90-beta(Homo sapiens (Human))
Pfizer
Curated by ChEMBL
LigandPNGBDBM50005781(ALVESPIMYCIN | CHEBI:65324)
Affinity DataEC50:  7.90nM. Assay description: Inhibition of Hsp90 in human A2058 cells
TargetHeat shock protein HSP 90-alpha(Homo sapiens (Human))
China Pharmaceutical University
Curated by ChEMBL
LigandPNGBDBM50005781(ALVESPIMYCIN | CHEBI:65324)
Affinity DataIC50:  919nM. Assay description: Inhibition of 6x-His tagged human recombinant full length Hsp90alpha ATPase preincubated for 0.5 hrs followed by ATP addition measured after 30 mins ...
TargetHeat shock protein HSP 90-alpha/90-beta(Homo sapiens (Human))
Pfizer
Curated by ChEMBL
LigandPNGBDBM50005781(ALVESPIMYCIN | CHEBI:65324)
Affinity DataIC50:  24nM. Assay description: Inhibition of Hsp90 in human SKBR3 cells
TargetHeat shock protein HSP 90-alpha/90-beta(Homo sapiens (Human))
Pfizer
Curated by ChEMBL
LigandPNGBDBM50005781(ALVESPIMYCIN | CHEBI:65324)
Affinity DataIC50:  24nM. Assay description: Inhibition of Hsp90 in human SKBR3 cells
TargetLysine-specific demethylase 4B(Homo sapiens (Human))
St. Jude Children'S Research Hospital
Curated by ChEMBL
LigandPNGBDBM50005781(ALVESPIMYCIN | CHEBI:65324)
Affinity DataIC50:  700nM. Assay description: Inhibition of KDM4B (unknown origin) measured by AlphaScreen assay
In DepthDetails PubMed
TargetLysine-specific demethylase 4C(Homo sapiens (Human))
St. Jude Children'S Research Hospital
Curated by ChEMBL
LigandPNGBDBM50005781(ALVESPIMYCIN | CHEBI:65324)
Affinity DataIC50:  700nM. Assay description: Inhibition of KDM4C (unknown origin) measured by AlphaScreen assay
In DepthDetails PubMed
TargetLysine-specific demethylase 5A(Homo sapiens (Human))
St. Jude Children'S Research Hospital
Curated by ChEMBL
LigandPNGBDBM50005781(ALVESPIMYCIN | CHEBI:65324)
Affinity DataIC50:  130nM. Assay description: Inhibition of KDM5A (unknown origin) measured by AlphaScreen assay
In DepthDetails PubMed
TargetHeat shock protein HSP 90-beta(Homo sapiens (Human))
China Pharmaceutical University
Curated by ChEMBL
LigandPNGBDBM50005781(ALVESPIMYCIN | CHEBI:65324)
Affinity DataIC50:  90nM. Assay description: Displacement of FITC-geldanamycin from HSP90 (unknown origin) after 30 mins by fluorescence polarization assay