BDBM50005805 8-Amino-3-benzyl-2-methylsulfanyl-1,9-dihydro-purin-6-one::CHEMBL32893
SMILES CSc1nc(O)c2nc(N)nc2n1Cc1ccccc1
InChI Key InChIKey=WJJXMTDWLUKUTN-UHFFFAOYSA-N
Data  1 IC50
  Tab Delimited (TSV)   2D SDfile   Computed 3D by Vconf -m prep SDfile
Find this compound or compounds like it in BindingDB:
Activity Spreadsheet -- Enzyme Inhibition Constant Data from BindingDB
Found 1 hit for monomerid = 50005805
TargetPurine nucleoside phosphorylase(Homo sapiens (Human))
Warner-Lambert
Curated by ChEMBL
LigandPNGBDBM50005805(8-Amino-3-benzyl-2-methylsulfanyl-1,9-dihydro-puri...)
Affinity DataIC50: >7.50E+4nM. Assay description: Inhibitory activity against Purine nucleoside phosphorylase evaluated by radiochemical assay
In DepthDetails ArticlePubMed