BDBM50005806 2,8-Diamino-3-furan-2-ylmethyl-1,9-dihydro-purin-6-one::CHEMBL32496
SMILES Nc1nc2c(O)nc(N)n(Cc3ccco3)c2n1
InChI Key InChIKey=WEEOMNXEKMPXSL-UHFFFAOYSA-N
Data  1 IC50
  Tab Delimited (TSV)   2D SDfile   Computed 3D by Vconf -m prep SDfile
Find this compound or compounds like it in BindingDB:
Activity Spreadsheet -- Enzyme Inhibition Constant Data from BindingDB
Found 1 hit for monomerid = 50005806
TargetPurine nucleoside phosphorylase(Homo sapiens (Human))
Warner-Lambert
Curated by ChEMBL
LigandPNGBDBM50005806(2,8-Diamino-3-furan-2-ylmethyl-1,9-dihydro-purin-6...)
Affinity DataIC50:  5.20E+3nM. Assay description: Inhibitory activity against Purine nucleoside phosphorylase evaluated by radiochemical assay
In DepthDetails ArticlePubMed