BDBM50005807 CHEMBL35798::N-(2-Amino-3-benzyl-6-oxo-6,9-dihydro-1H-purin-8-yl)-formamide
SMILES Nc1nc(O)c2nc(NC=O)nc2n1Cc1ccccc1
InChI Key InChIKey=AIEZXSBOYQJVTN-UHFFFAOYSA-N
Data  1 IC50
  Tab Delimited (TSV)   2D SDfile   Computed 3D by Vconf -m prep SDfile
Find this compound or compounds like it in BindingDB:
Activity Spreadsheet -- Enzyme Inhibition Constant Data from BindingDB
Found 1 hit for monomerid = 50005807
TargetPurine nucleoside phosphorylase(Homo sapiens (Human))
Warner-Lambert
Curated by ChEMBL
LigandPNGBDBM50005807(CHEMBL35798 | N-(2-Amino-3-benzyl-6-oxo-6,9-dihydr...)
Affinity DataIC50: >1.50E+5nM. Assay description: Inhibitory activity against Purine nucleoside phosphorylase evaluated by radiochemical assay
In DepthDetails ArticlePubMed