BDBM50005931 2-Methyl-dodecanoic acid (2,4,6-trimethoxy-phenyl)-amide::CHEMBL40644
SMILES CCCCCCCCCCC(C)C(=O)Nc1c(OC)cc(OC)cc1OC
InChI Key InChIKey=FQEAXLAJANPLEP-UHFFFAOYSA-N
Data  1 IC50
  Tab Delimited (TSV)   2D SDfile   Computed 3D by Vconf -m prep SDfile
Find this compound or compounds like it in BindingDB:
Activity Spreadsheet -- Enzyme Inhibition Constant Data from BindingDB
Found 1 hit for monomerid = 50005931
TargetAcyl-CoA:cholesterol acyltransferase(Oryctolagus cuniculus)
Warner-Lambert
Curated by ChEMBL
LigandPNGBDBM50005931(2-Methyl-dodecanoic acid (2,4,6-trimethoxy-phenyl)...)
Affinity DataIC50:  90nM. Assay description: Tested in vitro to inhibit Acyl coenzyme A:cholesterol acyltransferase in intestinal microsomes isolated from cholesterol-fed rabbits.
In DepthDetails ArticlePubMed