BDBM50006165 2-[1-Benzyl-2-(4-hydroxy-piperidin-1-yl)-2-oxo-ethoxy]-hexanoic acid (1-cyclohexylmethyl-2,3-dihydroxy-5-methyl-hexyl)-amide::CHEMBL299834
SMILES CCCC[C@H](O[C@@H](Cc1ccccc1)C(=O)N1CCC(O)CC1)C(=O)N[C@@H](CC1CCCCC1)[C@@H](O)[C@@H](O)CC(C)C
InChI Key InChIKey=QJUJAQHXTXIXTM-QEUNAIBPSA-N
Data  1 IC50
  Tab Delimited (TSV)   2D SDfile   Computed 3D by Vconf -m prep SDfile
Find this compound or compounds like it in BindingDB:
Activity Spreadsheet -- Enzyme Inhibition Constant Data from BindingDB
Found 1 hit for monomerid = 50006165
TargetRenin(Homo sapiens (Human))
Abbott Laboratories
Curated by ChEMBL
LigandPNGBDBM50006165(2-[1-Benzyl-2-(4-hydroxy-piperidin-1-yl)-2-oxo-eth...)
Affinity DataIC50:  130nMpH: 7.4Assay Description:In vitro potency against purified renin at a pH of 6.0.
In DepthDetails ArticlePubMed