BDBM50006188 CHEMBL300504::{1-[1-[1-Cyclohexylmethyl-2-hydroxy-5-methyl-4-(propane-2-sulfonylamino)-hexylcarbamoyl]-2-(1H-imidazol-4-yl)-ethylcarbamoyl]-2-phenyl-ethyl}-carbamic acid tert-butyl ester
SMILES CC(C)[C@H](C[C@H](O)[C@H](CC1CCCCC1)NC(=O)[C@H](Cc1cnc[nH]1)NC(=O)[C@H](Cc1ccccc1)NC(=O)OC(C)(C)C)NS(=O)(=O)C(C)C
InChI Key InChIKey=VISJLGFGFKKNTI-ZTTXAYQISA-N
Data  1 IC50
  Tab Delimited (TSV)   2D SDfile   Computed 3D by Vconf -m prep SDfile
Find this compound or compounds like it in BindingDB:
Activity Spreadsheet -- Enzyme Inhibition Constant Data from BindingDB
Found 1 hit for monomerid = 50006188
TargetRenin(Homo sapiens (Human))
Abbott Laboratories
Curated by ChEMBL
LigandPNGBDBM50006188(CHEMBL300504 | {1-[1-[1-Cyclohexylmethyl-2-hydroxy...)
Affinity DataIC50:  67nMpH: 6.0Assay Description:In vitro activity against human renin (pH 6.0)
In DepthDetails ArticlePubMed