BDBM50006189 (4-{2-[1-Benzyl-2-(4-methoxymethoxy-piperidin-1-yl)-2-oxo-ethoxy]-hexanoylamino}-5-cyclohexyl-3-hydroxy-1-isopropyl-pentyl)-carbamic acid 2-pyridin-2-yl-ethyl ester::CHEMBL46115
SMILES CCCC[C@H](O[C@@H](Cc1ccccc1)C(=O)N1CCC(CC1)OCOC)C(=O)N[C@@H](CC1CCCCC1)[C@@H](O)C[C@H](NC(=O)OCCc1ccccn1)C(C)C
InChI Key InChIKey=SECKIHGGZQDWLE-LSLOANPCSA-N
Data  2 IC50
  Tab Delimited (TSV)   2D SDfile   Computed 3D by Vconf -m prep SDfile
Find this compound or compounds like it in BindingDB:
Activity Spreadsheet -- Enzyme Inhibition Constant Data from BindingDB
Found 2 hits for monomerid = 50006189
TargetRenin(Homo sapiens (Human))
Abbott Laboratories
Curated by ChEMBL
LigandPNGBDBM50006189((4-{2-[1-Benzyl-2-(4-methoxymethoxy-piperidin-1-yl...)
Affinity DataIC50:  40nMpH: 7.4Assay Description:In vitro potency against human plasma renin at a pH of 7.4
In DepthDetails ArticlePubMed
TargetRenin(Homo sapiens (Human))
Abbott Laboratories
Curated by ChEMBL
LigandPNGBDBM50006189((4-{2-[1-Benzyl-2-(4-methoxymethoxy-piperidin-1-yl...)
Affinity DataIC50:  0.900nMpH: 6.0Assay Description:In vitro activity against human renin (pH 6.0)
In DepthDetails ArticlePubMed