BDBM50006278 6-Carboxymethyl-12-(3-guanidino-propyl)-5,8,11,14,17-pentaoxo-18-(3-trifluoromethyl-phenyl)-1-thia-4,7,10,13,16-pentaaza-cyclooctadecane-3-carboxylic acid::CHEMBL65442
SMILES NC(=N)NCCC[C@@H]1NC(=O)CNC(=O)C(SC[C@H](NC(=O)[C@H](CC(O)=O)NC(=O)CNC1=O)C(O)=O)c1cccc(c1)C(F)(F)F
InChI Key InChIKey=VEUVXVVWIPGJHE-TVISWJTBSA-N
Data  2 IC50
  Tab Delimited (TSV)   2D SDfile   Computed 3D by Vconf -m prep SDfile
Find this compound or compounds like it in BindingDB:
Activity Spreadsheet -- Enzyme Inhibition Constant Data from BindingDB
Found 2 hits for monomerid = 50006278
TargetIntegrin alpha-IIb/beta-3(Homo sapiens (Human))
Genentech
Curated by ChEMBL
LigandPNGBDBM50006278(6-Carboxymethyl-12-(3-guanidino-propyl)-5,8,11,14,...)
Affinity DataIC50:  35nM. Assay description: The compound was tested for the inhibition of fibrinogen receptor
In DepthDetails ArticlePubMed
TargetIntegrin alpha-IIb/beta-3(Homo sapiens (Human))
Genentech
Curated by ChEMBL
LigandPNGBDBM50006278(6-Carboxymethyl-12-(3-guanidino-propyl)-5,8,11,14,...)
Affinity DataIC50:  35nM. Assay description: The compound was tested for the inhibition of fibrinogen receptor
In DepthDetails ArticlePubMed