BDBM50006493 4-Carboxymethyl-4-hydroxy-2-methyl-chroman-7-carboxylic acid::CHEMBL70190
SMILES C[C@@H]1C[C@@](O)(CC(O)=O)c2ccc(cc2O1)C(O)=O
InChI Key InChIKey=SMDDRYRGXOXXAX-FUXBKTLASA-N
Data  1 IC50
  Tab Delimited (TSV)   2D SDfile   Computed 3D by Vconf -m prep SDfile
Find this compound or compounds like it in BindingDB:
Activity Spreadsheet -- Enzyme Inhibition Constant Data from BindingDB
Found 1 hit for monomerid = 50006493
TargetAldo-keto reductase family 1 member B1(Homo sapiens (Human))
Pfizer
Curated by ChEMBL
LigandPNGBDBM50006493(4-Carboxymethyl-4-hydroxy-2-methyl-chroman-7-carbo...)
Affinity DataIC50:  70nM. Assay description: Inhibitory activity against human placental aldose reductase
In DepthDetails ArticlePubMed