BDBM50006688 2-{2,3-Difluoro-4-[methyl-(2-methyl-4-oxo-3,4-dihydro-quinazolin-6-ylmethyl)-amino]-benzoylamino}-pentanedioic acid ;hydrate(0.75H2O)::CHEMBL77314
SMILES CN(Cc1ccc2nc(C)[nH]c(=O)c2c1)c1ccc(C(=O)N[C@@H](CCC(O)=O)C(O)=O)c(F)c1F
InChI Key InChIKey=RQAICJOIQDIWAH-UHFFFAOYSA-N
Data  1 IC50
  Tab Delimited (TSV)   2D SDfile   Computed 3D by Vconf -m prep SDfile
Find this compound or compounds like it in BindingDB:
Activity Spreadsheet -- Enzyme Inhibition Constant Data from BindingDB
Found 1 hit for monomerid = 50006688
TargetThymidylate synthase(Mus musculus)
Institute Of Cancer Research
Curated by ChEMBL
LigandPNGBDBM50006688(2-{2,3-Difluoro-4-[methyl-(2-methyl-4-oxo-3,4-dihy...)
Affinity DataIC50:  1.00E+3nM. Assay description: Inhibition of thymidylate synthase from L1210 cells
In DepthDetails ArticlePubMed