BDBM50006944 CHEMBL3237257
SMILES COC(=O)c1ccc(cc1)C1N(CCc2c[nH]c3ccccc23)C(=O)C(O)=C1C(=O)c1ccncc1
InChI Key InChIKey=FVQSDZBSWYFMDU-UHFFFAOYSA-N
Data  1 EC50
  Tab Delimited (TSV)   2D SDfile   Computed 3D by Vconf -m prep SDfile
Find this compound or compounds like it in BindingDB:
Activity Spreadsheet -- Enzyme Inhibition Constant Data from BindingDB
Found 1 hit for monomerid = 50006944
TargetGlutamate receptor ionotropic, NMDA 1/2C(RAT)
Emory University
Curated by ChEMBL
LigandPNGBDBM50006944(CHEMBL3237257)
Affinity DataEC50:  8.90E+3nM. Assay description: Potentiation of rat recombinant GluN1/GluN2C expressed in Xenopus laevis oocytes assessed as increase in glutamate/glycine-induced current response b...
In DepthDetails ArticlePubMed