BDBM50007032 CHEMBL3237550
SMILES OC[C@H]1O[C@@H](N2CC[C@H](O)NC2=O)C(F)(F)[C@@H]1O
InChI Key InChIKey=VUDZSIYXZUYWSC-XZBKPIIZSA-N
Data  1 IC50
  Tab Delimited (TSV)   2D SDfile   Computed 3D by Vconf -m prep SDfile
Find this compound or compounds like it in BindingDB:
Activity Spreadsheet -- Enzyme Inhibition Constant Data from BindingDB
Found 1 hit for monomerid = 50007032
TargetCytidine deaminase(Homo sapiens (Human))
Eisai
Curated by ChEMBL
LigandPNGBDBM50007032(CHEMBL3237550)
Affinity DataIC50:  5.00E+3nM. Assay description: Inhibition of human recombinant cytidine deaminase assessed as cytidine to uridine formation
In DepthDetails ArticlePubMed