BDBM50007060 1-(4-Methyl-thiazol-2-yl)-1-[3-(naphthalen-2-ylmethoxy)-phenyl]-propan-1-ol::CHEMBL69450
SMILES CCC(O)(c1nc(C)cs1)c1cccc(OCc2ccc3ccccc3c2)c1
InChI Key InChIKey=DQDPLVXAEUSMTM-UHFFFAOYSA-N
Data  1 IC50
  Tab Delimited (TSV)   2D SDfile   Computed 3D by Vconf -m prep SDfile
Find this compound or compounds like it in BindingDB:
Activity Spreadsheet -- Enzyme Inhibition Constant Data from BindingDB
Found 1 hit for monomerid = 50007060
TargetPolyunsaturated fatty acid 5-lipoxygenase(Mus musculus)
Ici Pharmaceuticals Group
Curated by ChEMBL
LigandPNGBDBM50007060(1-(4-Methyl-thiazol-2-yl)-1-[3-(naphthalen-2-ylmet...)
Affinity DataIC50:  820nM. Assay description: Inhibition of 5-lipoxygenase in mouse macrophages.
In DepthDetails ArticlePubMed