BDBM50007095 6,11-Diethyl-3-furan-3-ylmethyl-1,2,3,4,5,6-hexahydro-2,6-methano-benzo[d]azocin-8-ol::CHEMBL2367645::MR-2266
SMILES [H][C@]12Cc3ccc(O)cc3[C@@](CC)(CCN1Cc1ccoc1)[C@H]2CC
InChI Key InChIKey=HEYXXBUDMDVUNQ-TYPHKJRUSA-N
Data  1 IC50
  Tab Delimited (TSV)   2D SDfile   Computed 3D by Vconf -m prep SDfile
Find this compound or compounds like it in BindingDB:
Activity Spreadsheet -- Enzyme Inhibition Constant Data from BindingDB
Found 1 hit for monomerid = 50007095
TargetKappa-type opioid receptor(Cavia porcellus (domestic guinea pig))
University Of Washington
Curated by ChEMBL
LigandPNGBDBM50007095(6,11-Diethyl-3-furan-3-ylmethyl-1,2,3,4,5,6-hexahy...)
Affinity DataIC50:  1.60nM. Assay description: Displacement of [3H]-bremazocine from opioid receptor kappa of guinea pig membrane.
In DepthDetails ArticlePubMed