BDBM50007161 CHEMBL3237579::US10112928, Compound I-26
SMILES CCCc1nc(Nc2cc(NCCN)nnc2C(N)=O)ccc1OC
InChI Key InChIKey=BASSYYDTNNLLSN-UHFFFAOYSA-N
Data  4 IC50
  Tab Delimited (TSV)   2D SDfile   Computed 3D by Vconf -m prep SDfile
Find this compound or compounds like it in BindingDB:
Activity Spreadsheet -- Enzyme Inhibition Constant Data from BindingDB
Found 4 hits for monomerid = 50007161
TargetTyrosine-protein kinase SYK(Homo sapiens (Human))
Hoffmann-La Roche
Curated by ChEMBL
LigandPNGBDBM50007161(CHEMBL3237579 | US10112928, Compound I-26)
Affinity DataIC50:  40nM. Assay description: Inhibition of human SYK (360 to 635) using biotin-EPEGDYEEVLE as substrate preincubated for 10 mins followed by substrate/ATP/[33Pgamma]ATP addition ...
In DepthDetails ArticlePubMed
TargetTyrosine-protein kinase SYK [360-635](Homo sapiens (Human))
Hoffmann-La Roche
US Patent
LigandPNGBDBM50007161(CHEMBL3237579 | US10112928, Compound I-26)
Affinity DataIC50:  38nMpH: 7.5Assay Description:SYK kinase assay is a standard kinase assay adapted to a 96 well plate format. This assay is performed in 96-well format for IC50 determination with ...
In DepthDetails US Patent
TargetPotassium voltage-gated channel subfamily H member 2(Homo sapiens (Human))
Hoffmann-La Roche
Curated by ChEMBL
LigandPNGBDBM50007161(CHEMBL3237579 | US10112928, Compound I-26)
Affinity DataIC50:  1.00E+4nM. Assay description: Inhibition of human ERG expressed in CHO cells by patch clamp method
In DepthDetails ArticlePubMed
TargetTyrosine-protein kinase SYK(Homo sapiens (Human))
Hoffmann-La Roche
Curated by ChEMBL
LigandPNGBDBM50007161(CHEMBL3237579 | US10112928, Compound I-26)
Affinity DataIC50:  126nM. Assay description: Inhibition of SYK in human whole blood assessed as anti-human IgM-induced CD69 protein expression preincubated for 30 mins followed by anti-human IgM...
In DepthDetails ArticlePubMed