BDBM50007181 CHEMBL26539::N-{4-[4-(2-Methoxy-phenyl)-piperazin-1-yl]-butyl}-4-phenyl-butyramide
SMILES COc1ccccc1N1CCN(CCCCNC(=O)CCCc2ccccc2)CC1
InChI Key InChIKey=OGAWEZWHCWLAJP-UHFFFAOYSA-N
Data  3 KI
  Tab Delimited (TSV)   2D SDfile   Computed 3D by Vconf -m prep SDfile
Find this compound or compounds like it in BindingDB:
Activity Spreadsheet -- Enzyme Inhibition Constant Data from BindingDB
Found 3 hits for monomerid = 50007181
Target5-hydroxytryptamine receptor 1A(Rattus norvegicus (rat))
Virginia Commonwealth University
Curated by ChEMBL
LigandPNGBDBM50007181(CHEMBL26539 | N-{4-[4-(2-Methoxy-phenyl)-piperazin...)
Affinity DataKi:  12nM. Assay description: Binding affinity towards 5-hydroxytryptamine 1A receptor of rat hippocampus using [3H]-8-hydroxy-2-(di-n-propylamine) tetralin (8-OH-DPAT) as a radio...
In DepthDetails ArticlePubMed
Target5-hydroxytryptamine receptor 1A(Rattus norvegicus (rat))
Virginia Commonwealth University
Curated by ChEMBL
LigandPNGBDBM50007181(CHEMBL26539 | N-{4-[4-(2-Methoxy-phenyl)-piperazin...)
Affinity DataKi:  12nM. Assay description: Binding affinity of a compound to rat brain 5-hydroxytryptamine 1A (serotonin) receptor assayed by radiolabeled [3H]-8-OH-DPAT ligand displacement
In DepthDetails ArticlePubMed
TargetAlpha-1A/Alpha-1B/Alpha-1D adrenergic receptor(Rattus norvegicus (rat))
Virginia Commonwealth University
Curated by ChEMBL
LigandPNGBDBM50007181(CHEMBL26539 | N-{4-[4-(2-Methoxy-phenyl)-piperazin...)
Affinity DataKi:  84nM. Assay description: Binding affinity towards alpha-1 adrenergic receptor of rat frontal cortex using [3H]- WB- 4101 as a radioligand
In DepthDetails ArticlePubMed