BDBM50007206 CHEMBL3237867
SMILES [H][C@@]12C[C@@]([H])(C1(C)C)[C@]1(C)OB(O[C@]1([H])C2)[C@H](CC(C)C)NC(=O)[C@H](CCC(=O)NCCCC(COCc1ccccc1)COCc1ccccc1)NC(C)=O
InChI Key InChIKey=PKEANJOUYSERAO-XLKSJSKLSA-N
Data  3 IC50
  Tab Delimited (TSV)   2D SDfile   Computed 3D by Vconf -m prep SDfile
Find this compound or compounds like it in BindingDB:
Activity Spreadsheet -- Enzyme Inhibition Constant Data from BindingDB
Found 3 hits for monomerid = 50007206
TargetProteasome subunit beta type-7(Homo sapiens (Human))
Hokkaido University
Curated by ChEMBL
LigandPNGBDBM50007206(CHEMBL3237867)
Affinity DataIC50:  3.00E+3nM. Assay description: Inhibition of trypsin-like activity of human 20S proteasome using Ac-RLR-AMC as substrate
In DepthDetails ArticlePubMed
TargetProteasome subunit beta type-7(Homo sapiens (Human))
Hokkaido University
Curated by ChEMBL
LigandPNGBDBM50007206(CHEMBL3237867)
Affinity DataIC50:  46nM. Assay description: Inhibition of caspase-like activity of human 20S proteasome using Ac-nLPnLD-AMC as substrate
In DepthDetails ArticlePubMed
TargetProteasome subunit beta type-7(Homo sapiens (Human))
Hokkaido University
Curated by ChEMBL
LigandPNGBDBM50007206(CHEMBL3237867)
Affinity DataIC50:  4.10nM. Assay description: Inhibition of chymotrypsin-like activity of human 20S proteasome using Suc-LLVY-AMC as substrate
In DepthDetails ArticlePubMed