BDBM50007211 CHEMBL3237923
SMILES CCC[C@@H](N1C(=O)C(=N[C@@]11CC[C@@H](CC1)C(C)(C)C)c1cc(Cl)cc(Cl)c1)c1ccc(cc1)C(=O)NCc1nn[nH]n1
InChI Key InChIKey=SGDOKPUSXQWQSV-XAPASHSMSA-N
Data  4 IC50
  Tab Delimited (TSV)   2D SDfile   Computed 3D by Vconf -m prep SDfile
Find this compound or compounds like it in BindingDB:
Activity Spreadsheet -- Enzyme Inhibition Constant Data from BindingDB
Found 4 hits for monomerid = 50007211
TargetGlucagon receptor(Homo sapiens (Human))
Merck Research Laboratories
Curated by ChEMBL
LigandPNGBDBM50007211(CHEMBL3237923)
Affinity DataIC50:  55nM. Assay description: Displacement of [125I]-glucagon from recombinant human GCGR expressed in CHO cells after 60 mins by scintillation counting analysis
In DepthDetails ArticlePubMed
TargetGlucagon-like peptide 1 receptor(Homo sapiens (Human))
Merck Research Laboratories
Curated by ChEMBL
LigandPNGBDBM50007211(CHEMBL3237923)
Affinity DataIC50: >1.00E+4nM. Assay description: Antagonist activity at human GLP-1R expressed in CHO cells assessed as inhibition of GLP-1-stimulated cAMP production preincubated for 30 mins follow...
In DepthDetails ArticlePubMed
TargetGlucagon receptor(Homo sapiens (Human))
Merck Research Laboratories
Curated by ChEMBL
LigandPNGBDBM50007211(CHEMBL3237923)
Affinity DataIC50:  220nM. Assay description: Antagonist activity at human GCGR expressed in CHO cells assessed as inhibition of glucagon-stimulated cAMP production preincubated for 30 mins follo...
In DepthDetails ArticlePubMed
TargetGlucagon receptor(Mus musculus)
Merck Research Laboratories
Curated by ChEMBL
LigandPNGBDBM50007211(CHEMBL3237923)
Affinity DataIC50:  500nM. Assay description: Displacement of [125I]-glucagon from GCGR in mouse liver membranes after 60 mins by scintillation counting analysis
In DepthDetails ArticlePubMed