BDBM50007213 CHEMBL96772::[5-(6-Amino-purin-9-yl)-oxazolidin-2-yl]-methanol
SMILES Nc1ncnc2n(cnc12)C1CNC(CO)O1
InChI Key InChIKey=MBVIOAMRQRQQCJ-UHFFFAOYSA-N
Data  1 KI
  Tab Delimited (TSV)   2D SDfile   Computed 3D by Vconf -m prep SDfile
Find this compound or compounds like it in BindingDB:
Activity Spreadsheet -- Enzyme Inhibition Constant Data from BindingDB
Found 1 hit for monomerid = 50007213
TargetAdenosine deaminase(Homo sapiens (Human))
University Of Minnesota
Curated by ChEMBL
LigandPNGBDBM50007213(CHEMBL96772 | [5-(6-Amino-purin-9-yl)-oxazolidin-2...)
Affinity DataKi:  8.50E+4nM. Assay description: The compound was tested for binding affinity towards adenosine deaminase
In DepthDetails ArticlePubMed