BDBM50007382 2-(3,4-Dichloro-phenyl)-N-(1-dimethylaminomethyl-2-methyl-propyl)-N-methyl-acetamide::CHEMBL107461
SMILES CC(C)[C@@H](CN(C)C)N(C)C(=O)Cc1ccc(Cl)c(Cl)c1
InChI Key InChIKey=OHTBSGLCDUUXNN-OAHLLOKOSA-N
Data  1 IC50
  Tab Delimited (TSV)   2D SDfile   Computed 3D by Vconf -m prep SDfile
Find this compound or compounds like it in BindingDB:
Activity Spreadsheet -- Enzyme Inhibition Constant Data from BindingDB
Found 1 hit for monomerid = 50007382
TargetKappa-type opioid receptor(Cavia porcellus (domestic guinea pig))
Ici Pharmaceuticals Group
Curated by ChEMBL
LigandPNGBDBM50007382(2-(3,4-Dichloro-phenyl)-N-(1-dimethylaminomethyl-2...)
Affinity DataIC50:  105nM. Assay description: Binding affinity against opioid receptor kappa in guinea pig brain membrane using [3H]bremazocine as the radioligand
In DepthDetails ArticlePubMed