BDBM50007420 CHEMBL418289::Propionic acid 1-[4-(4-fluoro-phenyl)-4-oxo-butyl]-3-methyl-4-phenyl-piperidin-4-yl ester
SMILES CCC(=O)O[C@@]1(CCN(CCCC(=O)c2ccc(F)cc2)C[C@H]1C)c1ccccc1
InChI Key InChIKey=REXOMGWVBIKJKZ-KBMIEXCESA-N
Data  2 IC50
  Tab Delimited (TSV)   2D SDfile   Computed 3D by Vconf -m prep SDfile
Find this compound or compounds like it in BindingDB:
Activity Spreadsheet -- Enzyme Inhibition Constant Data from BindingDB
Found 2 hits for monomerid = 50007420
TargetD(2) dopamine receptor(Rattus norvegicus (rat))
Istituto Superiore Di Sanità
Curated by ChEMBL
LigandPNGBDBM50007420(CHEMBL418289 | Propionic acid 1-[4-(4-fluoro-pheny...)
Affinity DataIC50:  147nM. Assay description: Neuroleptic activity in terms of [3H]-spiroperidol binding to Dopamine receptor D2 in rat striatal membrane.
In DepthDetails ArticlePubMed
TargetMu-type opioid receptor(Rattus norvegicus (rat))
Istituto Superiore Di Sanità
Curated by ChEMBL
LigandPNGBDBM50007420(CHEMBL418289 | Propionic acid 1-[4-(4-fluoro-pheny...)
Affinity DataIC50:  1.79E+3nM. Assay description: Opioid activity in terms of inhibition of [3H]-dihydromorphine binding to Opioid receptor mu 1 in rat brain membrane.
In DepthDetails ArticlePubMed