BDBM50007560 1-Naphthalen-1-yl-4-[2-(4-[1,2,3]thiadiazol-4-yl-phenyl)-ethyl]-piperazine::CHEMBL53565
SMILES C(Cc1ccc(cc1)-c1csnn1)N1CCN(CC1)c1cccc2ccccc12
InChI Key InChIKey=VFLATHBHSNDSHU-UHFFFAOYSA-N
Data  1 IC50
  Tab Delimited (TSV)   2D SDfile   Computed 3D by Vconf -m prep SDfile
Find this compound or compounds like it in BindingDB:
Activity Spreadsheet -- Enzyme Inhibition Constant Data from BindingDB
Found 1 hit for monomerid = 50007560
TargetD(2) dopamine receptor(Rattus norvegicus (rat))
Pfizer
Curated by ChEMBL
LigandPNGBDBM50007560(1-Naphthalen-1-yl-4-[2-(4-[1,2,3]thiadiazol-4-yl-p...)
Affinity DataIC50:  83nM. Assay description: Binding affinity to dopamine receptor D2 in the rat brain using [3H]-NPA as radioligand
In DepthDetails ArticlePubMed