BDBM50007720 CHEMBL3233459
SMILES O=C(Cn1ccc(Nc2ccccc2)cc1=O)Nc1ccccc1C(=O)c1ccccc1
InChI Key InChIKey=BDQFWSFAEGBMON-UHFFFAOYSA-N
Data  2 KI
  Tab Delimited (TSV)   2D SDfile   Computed 3D by Vconf -m prep SDfile
Find this compound or compounds like it in BindingDB:
Activity Spreadsheet -- Enzyme Inhibition Constant Data from BindingDB
Found 2 hits for monomerid = 50007720
TargetChymotrypsinogen A(Bos taurus (bovine))
Universit£
Curated by ChEMBL
LigandPNGBDBM50007720(CHEMBL3233459)
Affinity DataKi:  6.65E+3nM. Assay description: Inhibition of bovine pancreatic alpha-chymotrypsin activity assessed as Suc-Leu-Leu-Val-Tyr-AMC substrate hydrolysis after 10 mins
In DepthDetails ArticlePubMed
TargetProteasome subunit beta type-5(Homo sapiens (Human))
Universit£
Curated by ChEMBL
LigandPNGBDBM50007720(CHEMBL3233459)
Affinity DataKi:  8.03E+3nM. Assay description: Inhibition of chymotrypsin-like activity of human 20S proteasome beta 5 subunit assessed as Suc-Leu-Leu-Val-Tyr-AMC substrate hydrolysis after 10 min...
In DepthDetails ArticlePubMed