BDBM50007721 CHEMBL3233443
SMILES CC(C)CCNC(=O)Cn1ccc2NCCCc2c1=O
InChI Key InChIKey=GNZCMORHWCDFNJ-UHFFFAOYSA-N
Data  1 KI
  Tab Delimited (TSV)   2D SDfile   Computed 3D by Vconf -m prep SDfile
Find this compound or compounds like it in BindingDB:
Activity Spreadsheet -- Enzyme Inhibition Constant Data from BindingDB
Found 1 hit for monomerid = 50007721
TargetProteasome subunit beta type-5(Homo sapiens (Human))
Universit£
Curated by ChEMBL
LigandPNGBDBM50007721(CHEMBL3233443)
Affinity DataKi:  1.01E+4nM. Assay description: Inhibition of chymotrypsin-like activity of human 20S proteasome beta 5 subunit assessed as Suc-Leu-Leu-Val-Tyr-AMC substrate hydrolysis after 10 min...
In DepthDetails ArticlePubMed