BDBM50007865 2-Oxo-2,3-dihydro-benzoimidazole-1-carboxylic acid 1-aza-bicyclo[2.2.2]oct-4-yl ester; hydrochloride::CHEMBL554844
SMILES O=C(OC12CCN(CC1)CC2)n1c2ccccc2[nH]c1=O
InChI Key InChIKey=SHBDMRHXDUTWKP-UHFFFAOYSA-N
Data  1 KI
  Tab Delimited (TSV)   2D SDfile   Computed 3D by Vconf -m prep SDfile
Find this compound or compounds like it in BindingDB:
Activity Spreadsheet -- Enzyme Inhibition Constant Data from BindingDB
Found 1 hit for monomerid = 50007865
Target5-hydroxytryptamine receptor 3A/3B(Rattus norvegicus)
Istituto De Angeli
Curated by ChEMBL
LigandPNGBDBM50007865(2-Oxo-2,3-dihydro-benzoimidazole-1-carboxylic acid...)
Affinity DataKi: >1.00E+3nM. Assay description: Concentration that inhibits the binding of radioligand, [3H]-ICS 205930, to 5-hydroxytryptamine 3 receptor from rat cortex
In DepthDetails ArticlePubMed