BDBM50008056 (+)-Benzoic acid 6-methyl-6-aza-bicyclo[3.2.1]oct-3-yl ester::(-)-Benzoic acid 6-methyl-6-aza-bicyclo[3.2.1]oct-3-yl ester::Benzoic acid 6-methyl-6-aza-bicyclo[3.2.1]oct-3-yl ester::CHEMBL287389
SMILES CN1CC2CC1CC(C2)OC(=O)c1ccccc1
InChI Key InChIKey=JJGGJOXCHDPVTJ-UHFFFAOYSA-N
Data  2 IC50
  Tab Delimited (TSV)   2D SDfile   Computed 3D by Vconf -m prep SDfile
Find this compound or compounds like it in BindingDB:
Activity Spreadsheet -- Enzyme Inhibition Constant Data from BindingDB
Found 2 hits for monomerid = 50008056
TargetSodium-dependent dopamine transporter(Rattus norvegicus (rat))
Research Triangle Institute
Curated by ChEMBL
LigandPNGBDBM50008056((+)-Benzoic acid 6-methyl-6-aza-bicyclo[3.2.1]oct-...)
Affinity DataIC50:  2.94E+3nM. Assay description: Inhibition of [3H]3-beta-(p-fluorophenyl)tropane-2beta-carboxylic acid methyl ester [3H]7a binding to Dopamine transporter of rat striatal membranes
In DepthDetails ArticlePubMed
TargetSodium-dependent dopamine transporter(Rattus norvegicus (rat))
Research Triangle Institute
Curated by ChEMBL
LigandPNGBDBM50008056((+)-Benzoic acid 6-methyl-6-aza-bicyclo[3.2.1]oct-...)
Affinity DataIC50:  2.85E+3nM. Assay description: Inhibition of [3H]3-beta-(p-fluorophenyl)tropane-2beta-carboxylic acid methyl ester [3H]7a binding to Dopamine transporter of rat striatal membranes
In DepthDetails ArticlePubMed