BDBM50008090 CHEMBL3234716
SMILES COC(=O)c1c(O)ccc2nc3c(cccc3nc12)C(O)=O
InChI Key InChIKey=QGRPCLYUAZBYBK-UHFFFAOYSA-N
Data  1 IC50
  Tab Delimited (TSV)   2D SDfile   Computed 3D by Vconf -m prep SDfile
Find this compound or compounds like it in BindingDB:
Activity Spreadsheet -- Enzyme Inhibition Constant Data from BindingDB
Found 1 hit for monomerid = 50008090
TargetMetallo-beta-lactamase L1 type 3(Stenotrophomonas maltophilia)
The University Of Queensland
Curated by ChEMBL
LigandPNGBDBM50008090(CHEMBL3234716)
Affinity DataIC50:  1.00E+3nM. Assay description: Inhibition of Stenotrophomonas maltophilia metallo-beta-lactamase L1 after 5 mins
In DepthDetails ArticlePubMed