BDBM50008091 1-[16-(4-Azido-benzyl)-13-benzyl-7-carbamoylmethyl-10-isopropyl-6,9,12,15,18-pentaoxo-1,2-dithia-5,8,11,14,17-pentaaza-cycloicosane-4-carbonyl]-pyrrolidine-2-carboxylic acid {5-amino-1-[1-carbamoyl-2-(4-hydroxy-phenyl)-ethylcarbamoyl]-pentyl}-amide::CHEMBL2372419
SMILES CC(C)[C@@H]1NC(=O)[C@H](Cc2ccccc2)NC(=O)[C@H](Cc2ccc(cc2)N=[N+]=[N-])NC(=O)CCSSC[C@H](NC(=O)[C@H](CC(N)=O)NC1=O)C(=O)N1CCC[C@H]1C(=O)N[C@@H](CCCCN)C(=O)N[C@H](Cc1ccc(O)cc1)C(N)=O
InChI Key InChIKey=FCBIPYLHWSAESG-VSANGWNWSA-N
Data  2 Kd
  Tab Delimited (TSV)   2D SDfile   Computed 3D by Vconf -m prep SDfile
Find this compound or compounds like it in BindingDB:
Activity Spreadsheet -- Enzyme Inhibition Constant Data from BindingDB
Found 2 hits for monomerid = 50008091
TargetVasopressin V1a receptor(RAT)
University Of Sherbrooke
Curated by ChEMBL
LigandPNGBDBM50008091(1-[16-(4-Azido-benzyl)-13-benzyl-7-carbamoylmethyl...)
Affinity DataKd:  4.90nM. Assay description: Binding potency against Vasopressin V1 receptor in rat liver cells.
In DepthDetails ArticlePubMed
TargetVasopressin V1a receptor(RAT)
University Of Sherbrooke
Curated by ChEMBL
LigandPNGBDBM50008091(1-[16-(4-Azido-benzyl)-13-benzyl-7-carbamoylmethyl...)
Affinity DataKd:  5nM. Assay description: Binding potency against Vasopressin V1 receptor in rat liver cells.
In DepthDetails ArticlePubMed