BDBM50008135 (1-{1-[1-Cyclohexylmethyl-3,3-difluoro-2-hydroxy-3-(2-morpholin-4-yl-ethylcarbamoyl)-propylcarbamoyl]-but-3-enylcarbamoyl}-2-phenyl-ethyl)-carbamic acid tert-butyl ester::CHEMBL285778
SMILES CC(C)(C)OC(=O)N[C@@H](Cc1ccccc1)C(=O)N[C@@H](CC=C)C(=O)N[C@@H](CC1CCCCC1)C(O)C(F)(F)C(=O)NCCN1CCOCC1
InChI Key InChIKey=JLENQMDKYKTRLR-UNVCSADESA-N
Data  2 IC50
  Tab Delimited (TSV)   2D SDfile   Computed 3D by Vconf -m prep SDfile
Find this compound or compounds like it in BindingDB:
Activity Spreadsheet -- Enzyme Inhibition Constant Data from BindingDB
Found 2 hits for monomerid = 50008135
TargetRenin(Homo sapiens (Human))
Warner-Lambert
Curated by ChEMBL
LigandPNGBDBM50008135((1-{1-[1-Cyclohexylmethyl-3,3-difluoro-2-hydroxy-3...)
Affinity DataIC50:  19nM. Assay description: The concentration producing 50% inhibition of renin activity in monkey plasma was determined by radioimmunoassay.
In DepthDetails ArticlePubMed
TargetCathepsin D(Bos taurus)
Warner-Lambert
Curated by ChEMBL
LigandPNGBDBM50008135((1-{1-[1-Cyclohexylmethyl-3,3-difluoro-2-hydroxy-3...)
Affinity DataIC50:  1.88E+4nM. Assay description: Inhibitory activity against bovine Cathepsin D
In DepthDetails ArticlePubMed