BDBM50008145 CHEMBL286147::Morpholine-4-carboxylic acid (1-{1-[1-cyclohexylmethyl-3,3-difluoro-3-(2-morpholin-4-yl-ethylcarbamoyl)-2-oxo-propylcarbamoyl]-but-3-enylcarbamoyl}-2-phenyl-ethyl)-amide
SMILES FC(F)(C(=O)NCCN1CCOCC1)C(=O)[C@H](CC1CCCCC1)NC(=O)[C@H](CC=C)NC(=O)[C@H](Cc1ccccc1)NC(=O)N1CCOCC1
InChI Key InChIKey=KUUQJUDFHATCIV-DTXPUJKBSA-N
Data  2 IC50
  Tab Delimited (TSV)   2D SDfile   Computed 3D by Vconf -m prep SDfile
Find this compound or compounds like it in BindingDB:
Activity Spreadsheet -- Enzyme Inhibition Constant Data from BindingDB
Found 2 hits for monomerid = 50008145
TargetRenin(Homo sapiens (Human))
Warner-Lambert
Curated by ChEMBL
LigandPNGBDBM50008145(CHEMBL286147 | Morpholine-4-carboxylic acid (1-{1-...)
Affinity DataIC50:  0.100nM. Assay description: The concentration producing 50% inhibition of renin activity in monkey plasma was determined by radioimmunoassay.
In DepthDetails ArticlePubMed
TargetCathepsin D(Bos taurus)
Warner-Lambert
Curated by ChEMBL
LigandPNGBDBM50008145(CHEMBL286147 | Morpholine-4-carboxylic acid (1-{1-...)
Affinity DataIC50:  33nM. Assay description: Inhibitory activity against bovine Cathepsin D
In DepthDetails ArticlePubMed