BDBM50008166 4-(3-Chloro-benzoylamino)-4-(3,3-diethyl-pentylcarbamoyl)-butyric acid::CHEMBL331413
SMILES CCC(CC)(CC)CCNC(=O)C(CCC(O)=O)NC(=O)c1cccc(Cl)c1
InChI Key InChIKey=BKLLKPJWIZCXKY-UHFFFAOYSA-N
Data  2 IC50
  Tab Delimited (TSV)   2D SDfile   Computed 3D by Vconf -m prep SDfile
Find this compound or compounds like it in BindingDB:
Activity Spreadsheet -- Enzyme Inhibition Constant Data from BindingDB
Found 2 hits for monomerid = 50008166
TargetCholecystokinin receptor type A(RAT)
Rotta Research Laboratorium
Curated by ChEMBL
LigandPNGBDBM50008166(4-(3-Chloro-benzoylamino)-4-(3,3-diethyl-pentylcar...)
Affinity DataIC50:  8.00E+3nM. Assay description: Concentration required to inhibit by 50% specific binding of [125I](BH)-CCK-8 to cholecystokinin type A receptor in rat pancreatic acini
In DepthDetails ArticlePubMed
TargetGastrin/cholecystokinin type B receptor(RAT)
Rotta Research Laboratorium
Curated by ChEMBL
LigandPNGBDBM50008166(4-(3-Chloro-benzoylamino)-4-(3,3-diethyl-pentylcar...)
Affinity DataIC50:  900nM. Assay description: Inhibition of the specific binding of [125I](BH)-CCK-8 to Cholecystokinin type B receptor in rat brain cortex
In DepthDetails ArticlePubMed