BDBM50008256 CHEMBL3234767
SMILES CCNC(=O)c1nnn(c1-c1ccc(CN2CCC[C@H](O)C2)cc1)-c1cc(C(C)C)c(O)cc1O
InChI Key InChIKey=WZMXCKPOKMINNZ-IBGZPJMESA-N
Data  1 IC50
  Tab Delimited (TSV)   2D SDfile   Computed 3D by Vconf -m prep SDfile
Find this compound or compounds like it in BindingDB:
Activity Spreadsheet -- Enzyme Inhibition Constant Data from BindingDB
Found 1 hit for monomerid = 50008256
TargetHeat shock protein HSP 90-alpha(Homo sapiens (Human))
Universit£
Curated by ChEMBL
LigandPNGBDBM50008256(CHEMBL3234767)
Affinity DataIC50:  23nM. Assay description: Displacement of GM-FITC from full-length recombinant human Hsp90-alpha after 4 hrs by fluorescence polarization assay
In DepthDetails ArticlePubMed