BDBM50008407 3-(5H-Thiazolo[2,3-b]quinazolin-3-yl)-phenol::3-(5H-Thiazolo[2,3-b]quinazolin-3-yl)-phenol(HTQZ)::CHEMBL72577
SMILES Oc1cccc(c1)C1=CSC2=Nc3ccccc3CN12
InChI Key InChIKey=FMVGAMNBEWTNFD-UHFFFAOYSA-N
Data  1 KI  2 IC50
  Tab Delimited (TSV)   2D SDfile   Computed 3D by Vconf -m prep SDfile
Find this compound or compounds like it in BindingDB:
Activity Spreadsheet -- Enzyme Inhibition Constant Data from BindingDB
Found 3 hits for monomerid = 50008407
TargetAdenosine receptor A1(Rattus norvegicus (rat))
Niddk
Curated by ChEMBL
LigandPNGBDBM50008407(3-(5H-Thiazolo[2,3-b]quinazolin-3-yl)-phenol | 3-(...)
Affinity DataKi:  3.10E+3nM. Assay description: Binding affinity against adenosine A1 receptor using [3H]-CHA or [3H]PIA as radioligand
In DepthDetails ArticlePubMed
TargetAdenosine receptor A2a/A2b(Rattus norvegicus)
Pfizer
Curated by ChEMBL
LigandPNGBDBM50008407(3-(5H-Thiazolo[2,3-b]quinazolin-3-yl)-phenol | 3-(...)
Affinity DataIC50:  530nM. Assay description: Evaluated for the binding affinity towards the Adenosine A2 receptor in corpora striata of rats using [3H]NECA as radioligand.
In DepthDetails ArticlePubMed
TargetAdenosine receptor A1(Rattus norvegicus (rat))
Niddk
Curated by ChEMBL
LigandPNGBDBM50008407(3-(5H-Thiazolo[2,3-b]quinazolin-3-yl)-phenol | 3-(...)
Affinity DataIC50:  1.80E+4nM. Assay description: Binding affinity towards the adenosine A1 receptor in cerebral cortices of Sprague-Dawley male rats using [3H]CHA as radioligand.
In DepthDetails ArticlePubMed