BDBM50008698 CHEMBL3235967
SMILES CC(C)(C)NC(=O)N1CCc2ccccc2[C@H]1c1ccc(cc1)C(F)(F)F
InChI Key InChIKey=JISPWJVBLUILMZ-GOSISDBHSA-N
Data  2 IC50
  Tab Delimited (TSV)   2D SDfile   Computed 3D by Vconf -m prep SDfile
Find this compound or compounds like it in BindingDB:
Activity Spreadsheet -- Enzyme Inhibition Constant Data from BindingDB
Found 2 hits for monomerid = 50008698
TargetTransient receptor potential cation channel subfamily M member 8(Rattus norvegicus (Rat))
Amgen
Curated by ChEMBL
LigandPNGBDBM50008698(CHEMBL3235967)
Affinity DataIC50:  45nM. Assay description: Antagonist activity at rat TRPM8 expressed in CHO cells assessed as inhibition of icilin-induced Ca2+ influx incubated 2.5 mins prior to icilin chall...
In DepthDetails ArticlePubMed
LigandPNGBDBM50008698(CHEMBL3235967)
Affinity DataIC50:  37nM. Assay description: Antagonist activity at human TRPM8 assessed as inhibition of icilin-induced Ca2+ influx incubated 2.5 mins prior to icilin challenge by luminometry
In DepthDetails ArticlePubMed